Merge branch 'master' into bug/oq_change_dec2021

7 jobs for bug/oq_change_dec2021 in 6 minutes and 10 seconds (queued for 1 minute and 1 second)
Name Stage Failure
failed
formatting Test
tests/shakemap_test.py:227:52: E1101: Generator 'generator' has no 'res' member (no-member)
tests/shakemap_test.py:227:52: E1101: Generator 'generator' has no 'res' member (no-member)
tests/shakemap_test.py:229:45: E1101: Generator 'generator' has no 'read' member (no-member)
tests/shakemap_test.py:229:45: E1101: Generator 'generator' has no 'read' member (no-member)
tests/shakemap_test.py:229:63: E1101: Generator 'generator' has no 'read' member (no-member)
tests/shakemap_test.py:229:63: E1101: Generator 'generator' has no 'read' member (no-member)

Cleaning up file based variables
ERROR: Job failed: exit code 1
failed
coverage Test
FAILED tests/workflows_test.py::GeofonWorkflowTestCase::test_complete_workflow_no_export_default_config
FAILED tests/workflows_test.py::GeofonWorkflowTestCase::test_workflow_with_exports
================= 14 failed, 93 passed, 19 warnings in 14.55s ==================
Uploading artifacts for failed job
Uploading artifacts...
WARNING: coverage.xml: no matching files
ERROR: No files to upload
Cleaning up file based variables
ERROR: Job failed: exit code 1
failed
test Test
FAILED tests/shakemap_test.py::ShakemapExportersTestCase::test_incorrect_raster_formulations
FAILED tests/shakemap_test.py::ShakemapExportersTestCase::test_transform_to_raster
FAILED tests/workflows_test.py::GeofonWorkflowTestCase::test_complete_workflow_crossing_antimeridian
FAILED tests/workflows_test.py::GeofonWorkflowTestCase::test_complete_workflow_no_export
FAILED tests/workflows_test.py::GeofonWorkflowTestCase::test_complete_workflow_no_export_default_config
FAILED tests/workflows_test.py::GeofonWorkflowTestCase::test_workflow_with_exports
================= 14 failed, 93 passed, 19 warnings in 12.19s ==================
Cleaning up file based variables
ERROR: Job failed: exit code 1